Reaction Details
Target5-hydroxytryptamine receptor 1A
LigandBDBM50073688
Substrate/Competitorn/a
Meas. Tech.ChEMBL_951 (CHEMBL616130)
Ki 6.1±n/a nM
Citation Xu, YCSchaus, JMWalker, CKrushinski, JAdham, NZgombick, JMLiang, SXKohlman, DTAudia, JE N-Methyl-5-tert-butyltryptamine: A novel, highly potent 5-HT1D receptor agonist. J Med Chem42:526-31 (1999) 
 
5-hydroxytryptamine receptor 1A
Name:5-hydroxytryptamine receptor 1A
Type:n/a
Mol. Mass.:46122.49
Organism:Homo sapiens (Human)
Description:n/a
Residue:422
BDBM50073688
NameBDBM50073688
Synonyms:CHEMBL357034 | [2-(5-tert-Butyl-1H-indol-3-yl)-ethyl]-methyl-amine
TypeSmall organic molecule
Emp. Form.C15H22N2
Mol. Mass.230.3486
SMILESCNCCc1c[nH]c2ccc(cc12)C(C)(C)C