Reaction Details
Target5-hydroxytryptamine receptor 1D
LigandBDBM50073691
Substrate/Competitorn/a
Meas. Tech.ChEMBL_1728 (CHEMBL616933)
Ki 6.4±n/a nM
Citation Xu, YCSchaus, JMWalker, CKrushinski, JAdham, NZgombick, JMLiang, SXKohlman, DTAudia, JE N-Methyl-5-tert-butyltryptamine: A novel, highly potent 5-HT1D receptor agonist. J Med Chem42:526-31 (1999) 
 
5-hydroxytryptamine receptor 1D
Name:5-hydroxytryptamine receptor 1D
Type:G Protein-Coupled Receptor (GPCR)
Mol. Mass.:41920.63
Organism:Homo sapiens (Human)
Description:Receptor binding assays were performed using human clone stably expressed in CHO cells.
Residue:377
BDBM50073691
NameBDBM50073691
Synonyms:2-(5-Methyl-1H-indol-3-yl)-ethylamine 5-Methyltryptamine EN300-651516
TypeSmall organic molecule
Emp. Form.C11H14N2
Mol. Mass.174.2423
SMILESCc1ccc2[nH]cc(CCN)c2c1