Reaction Details
TargetProstaglandin G/H synthase 2
LigandBDBM50029603
Substrate/Competitorn/a
Meas. Tech.ChEMBL_159905 (CHEMBL772071)
IC50 29±n/a nM
Citation Ouimet, NChan, CCCharleson, SClaveau, DGordon, RGuay, DLi, CSOuellet, MPercival, DMRiendeau, DWong, EZamboni, RPrasit, P Substituted heterocyclic analogs as selective COX-2 inhibitors in the flosulide class. Bioorg Med Chem Lett9:151-6 (1999) Prostaglandin G/H synthase 2
Name:Prostaglandin G/H synthase 2
Type:Enzyme
Mol. Mass.:69003.89
Organism:Homo sapiens (Human)
Description:Recombinant Cox-2 provided by Cayman (Cayman Chemical Co.,Ann Arbor, MI).
Residue:604
BDBM50029603
NameBDBM50029603
Synonyms:CHEMBL287919 L745,337 | N-[6-(2,4-Difluoro-phenylsulfanyl)-1-oxo-indan-5-yl]-methanesulfonamide
TypeSmall organic molecule
Emp. Form.C16H13F2NO3S2
Mol. Mass.369.406
SMILESCS(=O)(=O)Nc1cc2CCC(=O)c2cc1Sc1ccc(F)cc1F