Reaction Details
TargetEndoplasmic reticulum aminopeptidase 1
LigandBDBM50519953
Substrate/Competitorn/a
Meas. Tech.ChEMBL_1878771 (CHEMBL4380165)
IC50 5300±n/a nM
Citation Maben, ZArya, RRane, DAn, WFMetkar, SHickey, MBender, SAli, ANguyen, TTEvnouchidou, ISchilling, RStratikos, EGolden, JStern, LJ Discovery of Selective Inhibitors of Endoplasmic Reticulum Aminopeptidase 1. J Med Chem63:103-121 (2020) 
 
Endoplasmic reticulum aminopeptidase 1
Name:Endoplasmic reticulum aminopeptidase 1
Type:PROTEIN
Mol. Mass.:107232.03
Organism:Homo sapiens (Human)
Description:ChEMBL_1473167
Residue:941
BDBM50519953
NameBDBM50519953
Synonyms:CHEMBL2140832
TypeSmall organic molecule
Emp. Form.C20H21F3N2O5S
Mol. Mass.458.451
SMILESCOc1ccc(cc1S(=O)(=O)Nc1cc(ccc1N1CCCCC1)C(F)(F)F)C(O)=O