Reaction Details
TargetEndoplasmic reticulum aminopeptidase 1
LigandBDBM50519941
Substrate/Competitorn/a
Meas. Tech.ChEMBL_1878771 (CHEMBL4380165)
IC50 6900±n/a nM
Citation Maben, ZArya, RRane, DAn, WFMetkar, SHickey, MBender, SAli, ANguyen, TTEvnouchidou, ISchilling, RStratikos, EGolden, JStern, LJ Discovery of Selective Inhibitors of Endoplasmic Reticulum Aminopeptidase 1. J Med Chem63:103-121 (2020) 
 
Endoplasmic reticulum aminopeptidase 1
Name:Endoplasmic reticulum aminopeptidase 1
Type:PROTEIN
Mol. Mass.:107232.03
Organism:Homo sapiens (Human)
Description:ChEMBL_1473167
Residue:941
BDBM50519941
NameBDBM50519941
Synonyms:CHEMBL4528154
TypeSmall organic molecule
Emp. Form.C21H23F3N2O5S
Mol. Mass.472.478
SMILESCOC(=O)c1ccc(OC)c(c1)S(=O)(=O)Nc1cc(ccc1N1CCCCC1)C(F)(F)F