Reaction Details
TargetEndoplasmic reticulum aminopeptidase 1
LigandBDBM50519957
Substrate/Competitorn/a
Meas. Tech.ChEMBL_1878762 (CHEMBL4380156)
IC50 3600±n/a nM
Citation Maben, ZArya, RRane, DAn, WFMetkar, SHickey, MBender, SAli, ANguyen, TTEvnouchidou, ISchilling, RStratikos, EGolden, JStern, LJ Discovery of Selective Inhibitors of Endoplasmic Reticulum Aminopeptidase 1. J Med Chem63:103-121 (2020) 
 
Endoplasmic reticulum aminopeptidase 1
Name:Endoplasmic reticulum aminopeptidase 1
Type:PROTEIN
Mol. Mass.:107232.03
Organism:Homo sapiens (Human)
Description:ChEMBL_1473167
Residue:941
BDBM50519957
NameBDBM50519957
Synonyms:CHEMBL4586487
TypeSmall organic molecule
Emp. Form.C20H28ClN5O2
Mol. Mass.405.922
SMILESCC(=O)N1CCN(CC1)C(=O)C1(CCCCC1)NC(=N)Nc1ccc(Cl)cc1