Reaction Details
TargetInterstitial collagenase
LigandBDBM50074024
Substrate/Competitorn/a
Meas. Tech.ChEMBL_106127 (CHEMBL718675)
Ki 2000±n/a nM
Citation Groneberg, RDBurns, CJMorrissette, MMUllrich, JWMorris, RLDarnbrough, SDjuric, SWCondon, SMMcGeehan, GMLabaudiniere, RNeuenschwander, KScotese, ACKline, JA Dual inhibition of phosphodiesterase 4 and matrix metalloproteinases by an (arylsulfonyl)hydroxamic acid template. J Med Chem42:541-4 (1999) 
 
Interstitial collagenase
Name:Interstitial collagenase
Type:Enzyme
Mol. Mass.:54010.26
Organism:Homo sapiens (Human)
Description: P03956
Residue:469
BDBM50074024
NameBDBM50074024
Synonyms:(2S,3R)-3-(4-Methoxy-benzenesulfonyl)-2-methyl-7-phenyl-heptanoic acid hydroxyamide CHEMBL114116
TypeSmall organic molecule
Emp. Form.C21H27NO5S
Mol. Mass.405.508
SMILESCOc1ccc(cc1)S(=O)(=O)[C@H](CCCCc1ccccc1)[C@@H](C)C(=O)NO