Reaction Details
TargetIntegrin alpha-IIb/beta-3
LigandBDBM50074040
Substrate/Competitorn/a
Meas. Tech.ChEMBL_70312 (CHEMBL678017)
Ki 1200±n/a nM
Citation Keenan, RMCallahan, JFSamanen, JMBondinell, WECalvo, RRChen, LDeBrosse, CEggleston, DSHaltiwanger, RCHwang, SMJakas, DRKu, TWMiller, WHNewlander, KANichols, AParker, MFSouthhall, LSUzinskas, IVasko-Moser, JAVenslavsky, JWWong, ASHuffman, WF Conformational preferences in a benzodiazepine series of potent nonpeptide fibrinogen receptor antagonists. J Med Chem42:545-59 (1999) 
 
Integrin alpha-IIb/beta-3
Name:Integrin alpha-IIb/beta-3
Synonyms:Glycoprotein IIb/IIIa
Type:n/a
Mol. Mass.:n/a
Description:ASSAY_ID of EBI is 30109
Components:This complex has 2 components.
Component 1
Name:Integrin beta-3
Type:Protein
Mol. Mass.:87038.91
Organism:Homo sapiens (Human)
Description:P05106
Residue:788
Component 2
Name:Integrin alpha-IIb
Synonyms:CD_antigen=CD41 GPIIb Glycoprotein IIb ITGA2B Integrin alpha-IIb heavy chain Integrin alpha-IIb light chain, form 2 Integrin alpha-V/beta-3 and alpha-IIb/beta 3 | Platelet membrane glycoprotein IIb
Type:Protein
Mol. Mass.:113354.85
Organism:Homo sapiens (Human)
Description:P08514
Residue:1039
BDBM50074040
NameBDBM50074040
Synonyms:CHEMBL154864 | [7-(4-Carbamimidoyl-benzoylamino)-3-oxo-1,2,3,5-tetrahydro-benzo[e][1,4]diazepin-4-yl]-acetic acid
TypeSmall organic molecule
Emp. Form.C19H19N5O4
Mol. Mass.381.3853
SMILESNC(=N)c1ccc(cc1)C(=O)Nc1ccc2NCC(=O)N(CC(O)=O)Cc2c1