Reaction Details
TargetD(2) dopamine receptor
LigandBDBM50074092
Substrate/Competitorn/a
Meas. Tech.ChEMBL_58612 (CHEMBL666182)
Ki 168±n/a nM
Citation Khalil, EMOjala, WHPradhan, ANair, VDGleason, WBMishra, RKJohnson, RL Design, synthesis, and dopamine receptor modulating activity of spiro bicyclic peptidomimetics of L-prolyl-L-leucyl-glycinamide. J Med Chem42:628-37 (1999) 
 
D(2) dopamine receptor
Name:D(2) dopamine receptor
Type:Cell-surface receptors
Mol. Mass.:50647.10
Organism:Homo sapiens (Human)
Description:P14416
Residue:443
BDBM50074092
NameBDBM50074092
Synonyms:6'-oxo-1-[(2S)-tetrahydro-1H-2-pyrrolylcarbonyl]-(2'R,8a'R)-spiro[4H,5H-pyrrole-2,7'-perhydropyrrolo[2,1-b][1,3]thiazine]-4'-carboxamide | CHEMBL156164
TypeSmall organic molecule
Emp. Form.C16H24N4O3S
Mol. Mass.352.452
SMILESNC(=O)C1CCS[C@@H]2C[C@]3(CCCN3C(=O)[C@@H]3CCCN3)C(=O)N12