Reaction Details
TargetD(2) dopamine receptor
LigandBDBM50074093
Substrate/Competitorn/a
Meas. Tech.ChEMBL_58613 (CHEMBL666183)
Ki 260±n/a nM
Citation Khalil, EMOjala, WHPradhan, ANair, VDGleason, WBMishra, RKJohnson, RL Design, synthesis, and dopamine receptor modulating activity of spiro bicyclic peptidomimetics of L-prolyl-L-leucyl-glycinamide. J Med Chem42:628-37 (1999) 
 
D(2) dopamine receptor
Name:D(2) dopamine receptor
Type:Cell-surface receptors
Mol. Mass.:50647.10
Organism:Homo sapiens (Human)
Description:P14416
Residue:443
BDBM50074093
NameBDBM50074093
Synonyms:(2R,3'S,8a'R)-5'-oxo-1-((S)-pyrrolidine-2-carbonyl)hexahydrospiro[pyrrolidine-2,6'-thiazolo[3,2-a]pyridine]-3'-carboxamide RHPS4
TypeSmall organic molecule
Emp. Form.C16H24N4O3S
Mol. Mass.352.452
SMILESNC(=O)[C@H]1CS[C@@H]2CC[C@]3(CCCN3C(=O)[C@@H]3CCCN3)C(=O)N12