Reaction Details
Target5-hydroxytryptamine receptor 1D
LigandBDBM50060440
Substrate/Competitorn/a
Meas. Tech.ChEMBL_1680 (CHEMBL617040)
EC50 0.2±n/a nM
Citation Chambers, MSStreet, LJGoodacre, SHobbs, SCHunt, PJelley, RAMatassa, VGReeve, AJSternfeld, FBeer, MSStanton, JARathbone, DWatt, APMacLeod, AM 3-(Piperazinylpropyl)indoles: selective, orally bioavailable h5-HT1D receptor agonists as potential antimigraine agents. J Med Chem42:691-705 (1999) 
 
5-hydroxytryptamine receptor 1D
Name:5-hydroxytryptamine receptor 1D
Type:G Protein-Coupled Receptor (GPCR)
Mol. Mass.:41920.63
Organism:Homo sapiens (Human)
Description:Receptor binding assays were performed using human clone stably expressed in CHO cells.
Residue:377
BDBM50060440
NameBDBM50060440
Synonyms:3-[3-(4-Benzyl-piperazin-1-yl)-propyl]-5-[1,2,4]triazol-4-yl-1H-indole | CHEMBL65367
TypeSmall organic molecule
Emp. Form.C24H28N6
Mol. Mass.400.5193
SMILESC(CN1CCN(Cc2ccccc2)CC1)Cc1c[nH]c2ccc(cc12)-n1cnnc1