Reaction Details
Target5-hydroxytryptamine receptor 1D
LigandBDBM50074206
Substrate/Competitorn/a
Meas. Tech.ChEMBL_1680 (CHEMBL617040)
EC50 0.3±n/a nM
Citation Chambers, MSStreet, LJGoodacre, SHobbs, SCHunt, PJelley, RAMatassa, VGReeve, AJSternfeld, FBeer, MSStanton, JARathbone, DWatt, APMacLeod, AM 3-(Piperazinylpropyl)indoles: selective, orally bioavailable h5-HT1D receptor agonists as potential antimigraine agents. J Med Chem42:691-705 (1999) 
 
5-hydroxytryptamine receptor 1D
Name:5-hydroxytryptamine receptor 1D
Type:G Protein-Coupled Receptor (GPCR)
Mol. Mass.:41920.63
Organism:Homo sapiens (Human)
Description:Receptor binding assays were performed using human clone stably expressed in CHO cells.
Residue:377
BDBM50074206
NameBDBM50074206
Synonyms:3-[3-(4-Pyridin-3-ylmethyl-piperazin-1-yl)-propyl]-5-[1,2,4]triazol-4-yl-1H-indole | CHEMBL422366
TypeSmall organic molecule
Emp. Form.C23H27N7
Mol. Mass.401.5074
SMILESC(CN1CCN(Cc2cccnc2)CC1)Cc1c[nH]c2ccc(cc12)-n1cnnc1