Reaction Details
Target5-hydroxytryptamine receptor 1D
LigandBDBM50074202
Substrate/Competitorn/a
Meas. Tech.ChEMBL_1680 (CHEMBL617040)
EC50 0.3±n/a nM
Citation Chambers, MSStreet, LJGoodacre, SHobbs, SCHunt, PJelley, RAMatassa, VGReeve, AJSternfeld, FBeer, MSStanton, JARathbone, DWatt, APMacLeod, AM 3-(Piperazinylpropyl)indoles: selective, orally bioavailable h5-HT1D receptor agonists as potential antimigraine agents. J Med Chem42:691-705 (1999) 
 
5-hydroxytryptamine receptor 1D
Name:5-hydroxytryptamine receptor 1D
Type:G Protein-Coupled Receptor (GPCR)
Mol. Mass.:41920.63
Organism:Homo sapiens (Human)
Description:Receptor binding assays were performed using human clone stably expressed in CHO cells.
Residue:377
BDBM50074202
NameBDBM50074202
Synonyms:3-{3-[4-(2-Phenyl-propyl)-piperazin-1-yl]-propyl}-5-[1,2,4]triazol-4-yl-1H-indole | CHEMBL162722
TypeSmall organic molecule
Emp. Form.C26H32N6
Mol. Mass.428.5725
SMILESCC(CN1CCN(CCCc2c[nH]c3ccc(cc23)-n2cnnc2)CC1)c1ccccc1