Reaction Details
Target5-hydroxytryptamine receptor 1D
LigandBDBM50060425
Substrate/Competitorn/a
Meas. Tech.ChEMBL_1679 (CHEMBL616669)
EC50 0.8±n/a nM
Citation Chambers, MSStreet, LJGoodacre, SHobbs, SCHunt, PJelley, RAMatassa, VGReeve, AJSternfeld, FBeer, MSStanton, JARathbone, DWatt, APMacLeod, AM 3-(Piperazinylpropyl)indoles: selective, orally bioavailable h5-HT1D receptor agonists as potential antimigraine agents. J Med Chem42:691-705 (1999) 
 
5-hydroxytryptamine receptor 1D
Name:5-hydroxytryptamine receptor 1D
Type:G Protein-Coupled Receptor (GPCR)
Mol. Mass.:41920.63
Organism:Homo sapiens (Human)
Description:Receptor binding assays were performed using human clone stably expressed in CHO cells.
Residue:377
BDBM50060425
NameBDBM50060425
Synonyms:Benzyl-{(S)-1-[2-(5-[1,2,4]triazol-4-yl-1H-indol-3-yl)-ethyl]-pyrrolidin-3-ylmethyl}-amine L-760790
TypeSmall organic molecule
Emp. Form.C24H28N6
Mol. Mass.400.5193
SMILESC(Cc1c[nH]c2ccc(cc12)-n1cnnc1)N1CC[C@@H](CNCc2ccccc2)C1