Reaction Details
Target5-hydroxytryptamine receptor 1D
LigandBDBM50074205
Substrate/Competitorn/a
Meas. Tech.ChEMBL_1680 (CHEMBL617040)
EC50 0.2±n/a nM
Citation Chambers, MSStreet, LJGoodacre, SHobbs, SCHunt, PJelley, RAMatassa, VGReeve, AJSternfeld, FBeer, MSStanton, JARathbone, DWatt, APMacLeod, AM 3-(Piperazinylpropyl)indoles: selective, orally bioavailable h5-HT1D receptor agonists as potential antimigraine agents. J Med Chem42:691-705 (1999) 
 
5-hydroxytryptamine receptor 1D
Name:5-hydroxytryptamine receptor 1D
Type:G Protein-Coupled Receptor (GPCR)
Mol. Mass.:41920.63
Organism:Homo sapiens (Human)
Description:Receptor binding assays were performed using human clone stably expressed in CHO cells.
Residue:377
BDBM50074205
NameBDBM50074205
Synonyms:CHEMBL161176 | N-(3-{4-[3-(5-[1,2,4]Triazol-4-yl-1H-indol-3-yl)-propyl]-piperazin-1-ylmethyl}-phenyl)-acetamide
TypeSmall organic molecule
Emp. Form.C26H31N7O
Mol. Mass.457.5706
SMILESCC(=O)Nc1cccc(CN2CCN(CCCc3c[nH]c4ccc(cc34)-n3cnnc3)CC2)c1