Reaction Details
TargetCorticotropin-releasing factor receptor 1
LigandBDBM50074354
Substrate/Competitorn/a
Meas. Tech.ChEMBL_51111 (CHEMBL666549)
Ki 3±n/a nM
Citation Arvanitis, AGGilligan, PJChorvat, RJCheeseman, RSChristos, TEBakthavatchalam, RBeck, JPCocuzza, AJHobbs, FWWilde, RGArnold, CChidester, DCurry, MHe, LHollis, AKlaczkiewicz, JKrenitsky, PJRescinito, JPScholfield, ECulp, SDe Souza, EBFitzgerald, LGrigoriadis, DTam, SWShen, HL Non-peptide corticotropin-releasing hormone antagonists: syntheses and structure-activity relationships of 2-anilinopyrimidines and -triazines. J Med Chem42:805-18 (1999) 
 
Corticotropin-releasing factor receptor 1
Name:Corticotropin-releasing factor receptor 1
Type:Enzyme
Mol. Mass.:50744.31
Organism:Homo sapiens (Human)
Description:P34998
Residue:444
BDBM50074354
NameBDBM50074354
Synonyms:CHEMBL168131 | N,N-Diallyl-N'-(2-bromo-4-dimethylamino-phenyl)-N'-ethyl-6-methyl-[1,3,5]triazine-2,4-diamine
TypeSmall organic molecule
Emp. Form.C20H27BrN6
Mol. Mass.431.373
SMILESCCN(c1nc(C)nc(n1)N(CC=C)CC=C)c1ccc(cc1Br)N(C)C