Reaction Details
TargetCorticotropin-releasing factor receptor 1
LigandBDBM50074401
Substrate/Competitorn/a
Meas. Tech.ChEMBL_51111 (CHEMBL666549)
Ki 5±n/a nM
Citation Arvanitis, AGGilligan, PJChorvat, RJCheeseman, RSChristos, TEBakthavatchalam, RBeck, JPCocuzza, AJHobbs, FWWilde, RGArnold, CChidester, DCurry, MHe, LHollis, AKlaczkiewicz, JKrenitsky, PJRescinito, JPScholfield, ECulp, SDe Souza, EBFitzgerald, LGrigoriadis, DTam, SWShen, HL Non-peptide corticotropin-releasing hormone antagonists: syntheses and structure-activity relationships of 2-anilinopyrimidines and -triazines. J Med Chem42:805-18 (1999) 
 
Corticotropin-releasing factor receptor 1
Name:Corticotropin-releasing factor receptor 1
Type:Enzyme
Mol. Mass.:50744.31
Organism:Homo sapiens (Human)
Description:P34998
Residue:444
BDBM50074401
NameBDBM50074401
Synonyms:CHEMBL166345 | N-Allyl-N'-(2-bromo-4-isopropyl-phenyl)-N-cyclopropyl-N'-ethyl-6-methyl-[1,3,5]triazine-2,4-diamine
TypeSmall organic molecule
Emp. Form.C21H28BrN5
Mol. Mass.430.385
SMILESCCN(c1nc(C)nc(n1)N(CC=C)C1CC1)c1ccc(cc1Br)C(C)C