Reaction Details
TargetMuscarinic acetylcholine receptor M2
LigandBDBM50074557
Substrate/Competitorn/a
Meas. Tech.ChEMBL_139910 (CHEMBL746846)
EC50 520±n/a nM
Citation Nassif-Makki, TTränkle, CZlotos, DBejeuhr, GCambareri, APfletschinger, CKostenis, EMohr, KHolzgrabe, U Bisquaternary ligands of the common allosteric site of M2 acetylcholine receptors: search for the minimum essential distances between the pharmacophoric elements. J Med Chem42:849-58 (1999) 
 
Muscarinic acetylcholine receptor M2
Name:Muscarinic acetylcholine receptor M2
Type:Enzyme Catalytic Domain
Mol. Mass.:51688.65
Organism:GUINEA PIG
Description:Cholinergic, muscarinic 0 GUINEA PIG::P06199
Residue:466
BDBM50074557
NameBDBM50074557
Synonyms:Bis-{4-{[3-(1,3-Dioxo-1,3-dihydro-isoindol-2-yl)-propoxyimino]-methyl}-1-ethyl-pyridinium}dibromide | CHEMBL169475
TypeSmall organic molecule
Emp. Form.C37H36N6O6
Mol. Mass.660.7172
SMILESO=C1N(CCCO\N=C\c2cc[n+](CCC[n+]3ccc(\C=N\OCCCN4C(=O)c5ccccc5C4=O)cc3)cc2)C(=O)c2ccccc12