Reaction Details
TargetCannabinoid receptor 1
LigandBDBM50056491
Substrate/Competitorn/a
Meas. Tech.ChEMBL_46817 (CHEMBL657061)
Ki 51.2±n/a nM
Citation Lang, WQin, CLin, SKhanolkar, ADGoutopoulos, AFan, PAbouzid, KMeng, ZBiegel, DMakriyannis, A Substrate specificity and stereoselectivity of rat brain microsomal anandamide amidohydrolase. J Med Chem42:896-902 (1999) 
 
Cannabinoid receptor 1
Name:Cannabinoid receptor 1
Type:G Protein-Coupled Receptor (GPCR)
Mol. Mass.:52856.55
Organism:Rattus norvegicus (rat)
Description:P20272
Residue:473
BDBM50056491
NameBDBM50056491
Synonyms:(5Z,8Z,11Z,14Z)-Icosa-5,8,11,14-tetraenoic acid tert-butylamide | CHEMBL150942
TypeSmall organic molecule
Emp. Form.C24H41NO
Mol. Mass.359.5884
SMILESCCCCC\C=C/C\C=C/C\C=C/C\C=C/CCCC(=O)NC(C)(C)C