Reaction Details
TargetcAMP-specific 3',5'-cyclic phosphodiesterase 4A
LigandBDBM50074973
Substrate/Competitorn/a
Meas. Tech.ChEBML_155037
IC50 740±n/a nM
Citation Perrier, HBayly, CLaliberté, FHuang, ZRasori, RRobichaud, AGirard, YMacdonald, D Substituted furans as inhibitors of the PDE4 enzyme. Bioorg Med Chem Lett9:323-6 (1999) cAMP-specific 3',5'-cyclic phosphodiesterase 4A
Name:cAMP-specific 3',5'-cyclic phosphodiesterase 4A
Type:Enzyme
Mol. Mass.:98113.27
Organism:Homo sapiens (Human)
Description:P27815
Residue:886
BDBM50074973
NameBDBM50074973
Synonyms:2-[3-Benzenesulfonyl-5-(3-cyclopentyloxy-4-methoxy-phenyl)-furan-2-yl]-pyridine | CHEMBL321864
TypeSmall organic molecule
Emp. Form.C27H25NO5S
Mol. Mass.475.556
SMILESCOc1ccc(cc1OC1CCCC1)-c1cc(c(o1)-c1ccccn1)S(=O)(=O)c1ccccc1