Reaction Details
TargetProlyl endopeptidase
LigandBDBM50075126
Substrate/Competitorn/a
Meas. Tech.ChEBML_157469
IC50 14±n/a nM
Citation Vendeville, SBourel, LDavioud-Charvet, EGrellier, PDeprez, BSergheraert, C Automated parallel synthesis of a tetrahydroisoquinolin-based library: potential prolyl endopeptidase inhibitors. Bioorg Med Chem Lett9:437-42 (1999) Prolyl endopeptidase
Name:Prolyl endopeptidase
Type:Enzyme
Mol. Mass.:80688.50
Organism:Homo sapiens (Human)
Description:P48147
Residue:710
BDBM50075126
NameBDBM50075126
Synonyms:5-Phenyl-1-[(S)-3-(pyrrolidine-1-carbonyl)-3,4-dihydro-1H-isoquinolin-2-yl]-pentan-1-one | CHEMBL422281
TypeSmall organic molecule
Emp. Form.C25H30N2O2
Mol. Mass.390.5179
SMILESO=C(CCCCc1ccccc1)N1Cc2ccccc2C[C@H]1C(=O)N1CCCC1