Reaction Details
TargetProlyl endopeptidase
LigandBDBM50051539
Substrate/Competitorn/a
Meas. Tech.ChEBML_157469
IC50 15±n/a nM
Citation Vendeville, SBourel, LDavioud-Charvet, EGrellier, PDeprez, BSergheraert, C Automated parallel synthesis of a tetrahydroisoquinolin-based library: potential prolyl endopeptidase inhibitors. Bioorg Med Chem Lett9:437-42 (1999) Prolyl endopeptidase
Name:Prolyl endopeptidase
Type:Enzyme
Mol. Mass.:80688.50
Organism:Homo sapiens (Human)
Description:P48147
Residue:710
BDBM50051539
NameBDBM50051539
Synonyms:(S)-4-phenyl-1-(2-(pyrrolidine-1-carbonyl)pyrrolidin-1-yl)butan-1-one 4-Phenyl-1-[2-(pyrrolidine-1-carbonyl)-pyrrolidin-1-yl]-butan-1-one SUAM-1221
TypeSmall organic molecule
Emp. Form.C19H26N2O2
Mol. Mass.314.4219
SMILESO=C(CCCc1ccccc1)N1CCC[C@H]1C(=O)N1CCCC1