Reaction Details
TargetCapsid scaffolding protein
LigandBDBM50075139
Substrate/Competitorn/a
Meas. Tech.ChEBML_43071
IC50 21000±n/a nM
Citation Jarvest, RLPinto, ILAshman, SMDabrowski, CEFernandez, AVJennings, LJLavery, PTew, DG Inhibition of herpes proteases and antiviral activity of 2-substituted thieno[2,3-d]oxazinones. Bioorg Med Chem Lett9:443-8 (1999) Capsid scaffolding protein
Name:Capsid scaffolding protein
Type:PROTEIN
Mol. Mass.:64105.26
Organism:Epstein-Barr virus (strain B95-8) (HHV-4) (Human herpesvirus 4)
Description:ChEMBL_43071
Residue:605
BDBM50075139
NameBDBM50075139
Synonyms:(E)-3-(2,6-Dimethoxy-phenyl)-N-[(S)-1-(5-methyl-4-oxo-4H-thieno[2,3-d][1,3]oxazin-2-yl)-ethyl]-acrylamide | CHEMBL342608
TypeSmall organic molecule
Emp. Form.C20H20N2O5S
Mol. Mass.400.448
SMILESCOc1cccc(OC)c1\C=C\C(=O)N[C@@H](C)c1nc2scc(C)c2c(=O)o1