Reaction Details
TargetCapsid scaffolding protein
LigandBDBM50075166
Substrate/Competitorn/a
Meas. Tech.ChEBML_161075
IC50 10±n/a nM
Citation Jarvest, RLPinto, ILAshman, SMDabrowski, CEFernandez, AVJennings, LJLavery, PTew, DG Inhibition of herpes proteases and antiviral activity of 2-substituted thieno[2,3-d]oxazinones. Bioorg Med Chem Lett9:443-8 (1999) Capsid scaffolding protein
Name:Capsid scaffolding protein
Type:PROTEIN
Mol. Mass.:58627.41
Organism:Human herpesvirus 6A (strain Uganda-1102) (HHV-6 variant A) (Human Blymphotropic virus)
Description:ChEMBL_161075
Residue:528
BDBM50075166
NameBDBM50075166
Synonyms:(E)-3-(2,6-Dichloro-phenyl)-N-[(S)-1-(5-methyl-4-oxo-4H-thieno[2,3-d][1,3]oxazin-2-yl)-ethyl]-acrylamide | CHEMBL140709
TypeSmall organic molecule
Emp. Form.C18H14Cl2N2O3S
Mol. Mass.409.286
SMILESC[C@H](NC(=O)\C=C\c1c(Cl)cccc1Cl)c1nc2scc(C)c2c(=O)o1