Reaction Details
TargetSomatostatin receptor type 2
LigandBDBM50075280
Substrate/Competitorn/a
Meas. Tech.ChEMBL_200683 (CHEMBL807095)
Ki 6.3±n/a nM
Citation Pasternak, APan, YMarino, DSanderson, PEMosley, RRohrer, SPBirzin, ETHuskey, SEJacks, TSchleim, KDCheng, KSchaeffer, JMPatchett, AAYang, L Potent, orally bioavailable somatostatin agonists: good absorption achieved by urea backbone cyclization. Bioorg Med Chem Lett9:491-6 (1999) Somatostatin receptor type 2
Name:Somatostatin receptor type 2
Type:Enzyme
Mol. Mass.:41344.94
Organism:Homo sapiens (Human)
Description:P30874
Residue:369
BDBM50075280
NameBDBM50075280
Synonyms:(R)-6-Amino-2-{(2R,3S)-3-(1H-indol-3-yl)-2-[2-oxo-3-(4-phenyl-cyclohexyl)-imidazolidin-1-yl]-butyrylamino}-hexanoic acid tert-butyl ester | CHEMBL146536
TypeSmall organic molecule
Emp. Form.C37H51N5O4
Mol. Mass.629.8319
SMILESC[C@H]([C@@H](N1CCN(C2CCC(CC2)c2ccccc2)C1=O)C(=O)N[C@H](CCCCN)C(=O)OC(C)(C)C)c1c[nH]c2ccccc12