Reaction Details
TargetSomatostatin receptor type 2
LigandBDBM50075276
Substrate/Competitorn/a
Meas. Tech.ChEBML_200682
Ki 5.9±n/a nM
Citation Pasternak, APan, YMarino, DSanderson, PEMosley, RRohrer, SPBirzin, ETHuskey, SEJacks, TSchleim, KDCheng, KSchaeffer, JMPatchett, AAYang, L Potent, orally bioavailable somatostatin agonists: good absorption achieved by urea backbone cyclization. Bioorg Med Chem Lett9:491-6 (1999) Somatostatin receptor type 2
Name:Somatostatin receptor type 2
Type:Enzyme
Mol. Mass.:41344.94
Organism:Homo sapiens (Human)
Description:P30874
Residue:369
BDBM50075276
NameBDBM50075276
Synonyms:(R)-6-Amino-2-{(2R,3S)-3-(1H-indol-3-yl)-2-[2-oxo-3-(3-phenyl-butyl)-imidazolidin-1-yl]-butyrylamino}-hexanoic acid tert-butyl ester | CHEMBL147214
TypeSmall organic molecule
Emp. Form.C35H49N5O4
Mol. Mass.603.7947
SMILESCC(CCN1CCN([C@H]([C@@H](C)c2c[nH]c3ccccc23)C(=O)N[C@H](CCCCN)C(=O)OC(C)(C)C)C1=O)c1ccccc1