Reaction Details
TargetSomatostatin receptor type 2
LigandBDBM50075273
Substrate/Competitorn/a
Meas. Tech.ChEMBL_200682 (CHEMBL807094)
Ki 2.1±n/a nM
Citation Pasternak, APan, YMarino, DSanderson, PEMosley, RRohrer, SPBirzin, ETHuskey, SEJacks, TSchleim, KDCheng, KSchaeffer, JMPatchett, AAYang, L Potent, orally bioavailable somatostatin agonists: good absorption achieved by urea backbone cyclization. Bioorg Med Chem Lett9:491-6 (1999) Somatostatin receptor type 2
Name:Somatostatin receptor type 2
Type:Enzyme
Mol. Mass.:41344.94
Organism:Homo sapiens (Human)
Description:P30874
Residue:369
BDBM50075273
NameBDBM50075273
Synonyms:(2R,3S)-N-(5-Amino-[1,3]dioxan-2-ylmethyl)-3-(1H-indol-3-yl)-N-methyl-2-[2-oxo-3-(1-phenyl-piperidin-3-yl)-imidazolidin-1-yl]-butyramide | CHEMBL435631
TypeSmall organic molecule
Emp. Form.C32H42N6O4
Mol. Mass.574.7137
SMILESC[C@H]([C@@H](N1CCN(C2CCCN(C2)c2ccccc2)C1=O)C(=O)N(C)C[C@H]1OC[C@H](N)CO1)c1c[nH]c2ccccc12