Reaction Details
TargetRetinoic acid receptor RXR-alpha
LigandBDBM50075367
Substrate/Competitorn/a
Meas. Tech.ChEBML_196910
Kd 7±n/a nM
Citation Vuligonda, VGarst, MEChandraratna, RA Stereoselective synthesis and receptor activity of conformationally defined retinoid X receptor selective ligands. Bioorg Med Chem Lett9:589-94 (1999) Retinoic acid receptor RXR-alpha
Name:Retinoic acid receptor RXR-alpha
Type:PROTEIN
Mol. Mass.:50820.38
Organism:Homo sapiens (Human)
Description:ChEMBL_1456363
Residue:462
BDBM50075367
NameBDBM50075367
Synonyms:(2E,4E)-3-Methyl-5-{2-[(E)-2-(2,6,6-trimethyl-cyclohex-1-enyl)-vinyl]-furan-3-yl}-penta-2,4-dienoic acid | CHEMBL347411
TypeSmall organic molecule
Emp. Form.C21H26O3
Mol. Mass.326.4293
SMILESC\C(\C=C\c1ccoc1\C=C\C1=C(C)CCCC1(C)C)=C/C(O)=O