Reaction Details
TargetNeuropeptide Y receptor type 1
LigandBDBM50075803
Substrate/Competitorn/a
Meas. Tech.ChEBML_143824
Ki 0.132000±n/a nM
Citation Zarrinmayeh, HZimmerman, DMCantrell, BESchober, DABruns, RFGackenheimer, SLOrnstein, PLHipskind, PABritton, TCGehlert, DR Structure-activity relationship of a series of diaminoalkyl substituted benzimidazole as neuropeptide Y Y1 receptor antagonists. Bioorg Med Chem Lett9:647-52 (1999) Neuropeptide Y receptor type 1
Name:Neuropeptide Y receptor type 1
Type:Enzyme Catalytic Domain
Mol. Mass.:44399.07
Organism:Homo sapiens (Human)
Description:NPY-Y1 NPY1R HUMAN::P25929
Residue:384
BDBM50075803
NameBDBM50075803
Synonyms:4-(4-{3-[2-Phenoxymethyl-4-(3-piperidin-1-yl-propoxy)-benzoimidazol-1-yl]-propyl}-piperidin-1-yl)-1-phenyl-butan-1-one | CHEMBL439643
TypeSmall organic molecule
Emp. Form.C40H52N4O3
Mol. Mass.636.8659
SMILESO=C(CCCN1CCC(CCCn2c(COc3ccccc3)nc3c(OCCCN4CCCCC4)cccc23)CC1)c1ccccc1