Reaction Details
TargetProtein farnesyltransferase subunit beta/geranylgeranyltransferase type-1 subunit alpha
LigandBDBM50075857
Substrate/Competitorn/a
Meas. Tech.ChEBML_70297
IC50 0.630000±n/a nM
Citation Shen, WFakhoury, SDonner, GHenry, KLee, JZhang, HCohen, JWarner, RSaeed, BCherian, STahir, SKovar, PBauch, JNg, SCMarsh, KSham, HRosenberg, S Potent inhibitors of protein farnesyltransferase: heteroarenes as cysteine replacements. Bioorg Med Chem Lett9:703-8 (1999) Protein farnesyltransferase subunit beta/geranylgeranyltransferase type-1 subunit alpha
Name:Protein farnesyltransferase subunit beta/geranylgeranyltransferase type-1 subunit alpha
Type:Protein Complex
Mol. Mass.:n/a
Description:To express recombinant enzyme in E. coli, the cloned human alpha and beta subunits were co-expressed from a plasmid, in which their expression was translationally coupled.
Components:This complex has 2 components.
Component 1
Name:Protein farnesyltransferase subunit beta
Synonyms:CAAX farnesyltransferase subunit alpha FNTB FTase-alpha GGTase-I-alpha Protein farnesyl/geranylgeranyl transferase Protein farnesyltransferase subunit beta Protein farnesyltransferase/geranylgeranyltransferase type-1 subunit alpha Ras proteins prenyltransferase subunit beta | Type I protein geranyl-geranyltransferase subunit alpha
Type:Enzyme Subunit
Mol. Mass.:48766.02
Organism:Homo sapiens (Human)
Description:Protein farnesyltransferase subunit beta
Residue:437
Component 2
Name:Protein farnesyltransferase/geranylgeranyltransferase type-1 subunit alpha
Synonyms:CAAX farnesyltransferase alpha subunit FNTA_HUMAN FTase-alpha Geranylgeranyl Transferase (GGTase-I) Chain A Protein Farnesyltransferase (PFT) Chain A Protein farnesyltransferase Protein farnesyltransferase/geranylgeranyltransferase type I alpha subunit | Ras proteins prenyltransferase alpha
Type:Enzyme
Mol. Mass.:44392.46
Organism:Homo sapiens (Human)
Description:Recombinant human FTase.
Residue:379
BDBM50075857
NameBDBM50075857
Synonyms:(S)-2-({5-[(E)-2-(3H-Imidazol-4-yl)-vinyl]-2'-methyl-biphenyl-2-carbonyl}-amino)-4-methylsulfanyl-butyric acid | CHEMBL350180
TypeSmall organic molecule
Emp. Form.C24H25N3O3S
Mol. Mass.435.539
SMILESCSCC[C@H](NC(=O)c1ccc(C=Cc2cnc[nH]2)cc1-c1ccccc1C)C(O)=O