Reaction Details
TargetRetinoic acid receptor alpha
LigandBDBM50075878
Substrate/Competitorn/a
Meas. Tech.ChEMBL_225937 (CHEMBL874059)
IC50 5.5±n/a nM
Citation Vuligonda, VStandeven, AMEscobar, MChandraratna, RA A new class of potent RAR antagonists: dihydroanthracenyl, benzochromenyl and benzothiochromenyl retinoids. Bioorg Med Chem Lett9:743-8 (1999) Retinoic acid receptor alpha
Name:Retinoic acid receptor alpha
Type:PROTEIN
Mol. Mass.:50778.87
Organism:Homo sapiens (Human)
Description:ChEMBL_1466191
Residue:462
BDBM50075878
NameBDBM50075878
Synonyms:4-(2,2-Dimethyl-4-p-tolyl-2H-benzo[g]chromen-7-yl)-benzoic acid | CHEMBL162345
TypeSmall organic molecule
Emp. Form.C29H24O3
Mol. Mass.420.4991
SMILESCc1ccc(cc1)C1=CC(C)(C)Oc2cc3ccc(cc3cc12)-c1ccc(cc1)C(O)=O