Reaction Details
TargetAndrogen receptor
LigandBDBM50403730
Substrate/Competitorn/a
Meas. Tech.ChEMBL_35936 (CHEMBL646844)
EC50 5±n/a nM
Citation Edwards, JPHiguchi, RIWinn, DTPooley, CLCaferro, TRHamann, LGZhi, LMarschke, KBGoldman, MEJones, TK Nonsteroidal androgen receptor agonists based on 4-(trifluoromethyl)-2H-pyrano[3,2-g]quinolin-2-one. Bioorg Med Chem Lett9:1003-8 (1999) Androgen receptor
Name:Androgen receptor
Type:Receptor
Mol. Mass.:99185.27
Organism:Homo sapiens (Human)
Description:CHO cells were stably transfected with human AR gene.
Residue:920
BDBM50403730
NameBDBM50403730
Synonyms:CHEMBL2052002
TypeSmall organic molecule
Emp. Form.C17H18F3NO2
Mol. Mass.325.3255
SMILESCC[C@H]1CNc2cc3oc(=O)cc(c3cc2[C@@H]1CC)C(F)(F)F