Reaction Details
TargetProgesterone receptor
LigandBDBM50076695
Substrate/Competitorn/a
Meas. Tech.ChEBML_159382
IC50 100±n/a nM
Citation Edwards, JPHiguchi, RIWinn, DTPooley, CLCaferro, TRHamann, LGZhi, LMarschke, KBGoldman, MEJones, TK Nonsteroidal androgen receptor agonists based on 4-(trifluoromethyl)-2H-pyrano[3,2-g]quinolin-2-one. Bioorg Med Chem Lett9:1003-8 (1999) Progesterone receptor
Name:Progesterone receptor
Type:Protein
Mol. Mass.:98979.52
Organism:Homo sapiens (Human)
Description:P06401
Residue:933
BDBM50076695
NameBDBM50076695
Synonyms:5,7,7-Trimethyl-4-trifluoromethyl-7,8-dihydro-1-oxa-8-aza-anthracen-2-one | CHEMBL6441
TypeSmall organic molecule
Emp. Form.C16H14F3NO2
Mol. Mass.309.2831
SMILESCC1=CC(C)(C)Nc2cc3oc(=O)cc(c3cc12)C(F)(F)F