Reaction Details
TargetProgesterone receptor
LigandBDBM50076685
Substrate/Competitorn/a
Meas. Tech.ChEBML_159382
IC50 440±n/a nM
Citation Edwards, JPHiguchi, RIWinn, DTPooley, CLCaferro, TRHamann, LGZhi, LMarschke, KBGoldman, MEJones, TK Nonsteroidal androgen receptor agonists based on 4-(trifluoromethyl)-2H-pyrano[3,2-g]quinolin-2-one. Bioorg Med Chem Lett9:1003-8 (1999) Progesterone receptor
Name:Progesterone receptor
Type:Protein
Mol. Mass.:98979.52
Organism:Homo sapiens (Human)
Description:P06401
Residue:933
BDBM50076685
NameBDBM50076685
Synonyms:7-Ethyl-6-methyl-4-trifluoromethyl-5,6,7,8-tetrahydro-1-oxa-8-aza-anthracen-2-one | CHEMBL6654
TypeSmall organic molecule
Emp. Form.C16H16F3NO2
Mol. Mass.311.2989
SMILESCCC1Nc2cc3oc(=O)cc(c3cc2CC1C)C(F)(F)F