Reaction Details
TargetAndrogen receptor
LigandBDBM50076684
Substrate/Competitorn/a
Meas. Tech.ChEMBL_36117 (CHEMBL648082)
IC50 2±n/a nM
Citation Edwards, JPHiguchi, RIWinn, DTPooley, CLCaferro, TRHamann, LGZhi, LMarschke, KBGoldman, MEJones, TK Nonsteroidal androgen receptor agonists based on 4-(trifluoromethyl)-2H-pyrano[3,2-g]quinolin-2-one. Bioorg Med Chem Lett9:1003-8 (1999) Androgen receptor
Name:Androgen receptor
Type:Receptor
Mol. Mass.:99185.27
Organism:Homo sapiens (Human)
Description:CHO cells were stably transfected with human AR gene.
Residue:920
BDBM50076684
NameBDBM50076684
Synonyms:4,5-Bis-trifluoromethyl-5,6,7,8-tetrahydro-1-oxa-8-aza-anthracen-2-one | CHEMBL267270
TypeSmall organic molecule
Emp. Form.C14H9F6NO2
Mol. Mass.337.2172
SMILESFC(F)(F)C1CCNc2cc3oc(=O)cc(c3cc12)C(F)(F)F