Reaction Details
TargetProthrombin
LigandBDBM50076823
Substrate/Competitorn/a
Meas. Tech.ChEBML_208317
Ki 16±n/a nM
Citation Ambler, JBentley, DBrown, LDunnet, KFarr, DJanus, DLe Grand, DMenear, KMercer, MTalbot, MTweed, MWathey, B The discovery of orally available thrombin inhibitors: optimisation of the P1 pharmacophore. Bioorg Med Chem Lett9:1103-8 (1999) Prothrombin
Name:Prothrombin
Type:Protein
Mol. Mass.:70029.57
Organism:Homo sapiens (Human)
Description:P00734
Residue:622
BDBM50076823
NameBDBM50076823
Synonyms:4-((S)-1-Hydroxymethyl-2-phenyl-ethylamino)-pyridine-3-sulfonic acid {(S)-1-[4-(2-fluoro-ethyl)-piperidine-1-carbonyl]-3-guanidino-propyl}-amide | CHEMBL276481
TypeSmall organic molecule
Emp. Form.C26H38FN7O4S
Mol. Mass.563.688
SMILESNC(=N)NCC[C@H](NS(=O)(=O)c1cnccc1N[C@H](CO)Cc1ccccc1)C(=O)N1CCC(CCF)CC1