Reaction Details
TargetProthrombin
LigandBDBM50076828
Substrate/Competitorn/a
Meas. Tech.ChEBML_208317
Ki 12±n/a nM
Citation Ambler, JBentley, DBrown, LDunnet, KFarr, DJanus, DLe Grand, DMenear, KMercer, MTalbot, MTweed, MWathey, B The discovery of orally available thrombin inhibitors: optimisation of the P1 pharmacophore. Bioorg Med Chem Lett9:1103-8 (1999) Prothrombin
Name:Prothrombin
Type:Protein
Mol. Mass.:70029.57
Organism:Homo sapiens (Human)
Description:P00734
Residue:622
BDBM50076828
NameBDBM50076828
Synonyms:4-((S)-1-Hydroxymethyl-2-phenyl-ethylamino)-pyridine-3-sulfonic acid [(S)-2-[4-(2-fluoro-ethyl)-piperidin-1-yl]-1-(4-methylamino-phenyl)-2-oxo-ethyl]-amide | CHEMBL267544
TypeSmall organic molecule
Emp. Form.C30H38FN5O4S
Mol. Mass.583.717
SMILESCNc1ccc(cc1)[C@H](NS(=O)(=O)c1cnccc1N[C@H](CO)Cc1ccccc1)C(=O)N1CCC(CCF)CC1