Reaction Details
TargetVoltage-dependent N-type calcium channel subunit alpha-1B
LigandBDBM50076838
Substrate/Competitorn/a
Meas. Tech.ChEBML_88175
IC50 320±n/a nM
Citation Hu, LYRyder, TRNikam, SSMillerman, ESzoke, BGRafferty, MF Synthesis and biological evaluation of substituted 4-(OBz)phenylalanine derivatives as novel N-type calcium channel blockers. Bioorg Med Chem Lett9:1121-6 (1999) Voltage-dependent N-type calcium channel subunit alpha-1B
Name:Voltage-dependent N-type calcium channel subunit alpha-1B
Type:Enzyme
Mol. Mass.:262548.16
Organism:Homo sapiens (Human)
Description:Q00975
Residue:2339
BDBM50076838
NameBDBM50076838
Synonyms:Benzoic acid 4-((S)-2-tert-butoxycarbonyl-2-{[6-methyl-1-(3-methyl-butyl)-piperidine-2-carbonyl]-amino}-ethyl)-phenyl ester | CHEMBL13674
TypeSmall organic molecule
Emp. Form.C32H44N2O5
Mol. Mass.536.7022
SMILESCC(C)CCN1C(C)CCCC1C(=O)N[C@@H](Cc1ccc(OC(=O)c2ccccc2)cc1)C(=O)OC(C)(C)C