Reaction Details
TargetProthrombin
LigandBDBM50077042
Substrate/Competitorn/a
Meas. Tech.ChEBML_208529
Ki 93±n/a nM
Citation Ambler, JBrown, LCockcroft, XLGrütter, MHayler, JJanus, DJones, DKane, PMenear, KPriestle, JSmith, GTalbot, MWalker, CVWathey, B Optimisation of the P2 pharmacophore in a series of thrombin inhibitors: ion-dipole interactions with lysine 60G. Bioorg Med Chem Lett9:1317-22 (1999) Prothrombin
Name:Prothrombin
Type:Protein
Mol. Mass.:70029.57
Organism:Homo sapiens (Human)
Description:P00734
Residue:622
BDBM50077042
NameBDBM50077042
Synonyms:3,3-Dimethyl-1,2,3,4-tetrahydro-quinoline-8-sulfonic acid {(S)-1-benzothiazol-2-ylmethyl-2-[4-(2-chloro-ethyl)-piperidin-1-yl]-2-oxo-ethyl}-amide | CHEMBL24933
TypeSmall organic molecule
Emp. Form.C28H35ClN4O3S2
Mol. Mass.575.185
SMILESCC1(C)CNc2c(C1)cccc2S(=O)(=O)N[C@@H](Cc1nc2ccccc2s1)C(=O)N1CCC(CCCl)CC1