Reaction Details
TargetProthrombin
LigandBDBM50077045
Substrate/Competitorn/a
Meas. Tech.ChEBML_208529
Ki 38320.0±n/a nM
Citation Ambler, JBrown, LCockcroft, XLGrütter, MHayler, JJanus, DJones, DKane, PMenear, KPriestle, JSmith, GTalbot, MWalker, CVWathey, B Optimisation of the P2 pharmacophore in a series of thrombin inhibitors: ion-dipole interactions with lysine 60G. Bioorg Med Chem Lett9:1317-22 (1999) Prothrombin
Name:Prothrombin
Type:Protein
Mol. Mass.:70029.57
Organism:Homo sapiens (Human)
Description:P00734
Residue:622
BDBM50077045
NameBDBM50077045
Synonyms:3,3-Dimethyl-1,2,3,4-tetrahydro-quinoline-8-sulfonic acid {(S)-1-benzothiazol-2-ylmethyl-2-[4-(2-dimethylamino-ethyl)-piperidin-1-yl]-2-oxo-ethyl}-amide | CHEMBL27726
TypeSmall organic molecule
Emp. Form.C30H41N5O3S2
Mol. Mass.583.808
SMILESCN(C)CCC1CCN(CC1)C(=O)[C@H](Cc1nc2ccccc2s1)NS(=O)(=O)c1cccc2CC(C)(C)CNc12