Reaction Details
TargetProthrombin
LigandBDBM50077050
Substrate/Competitorn/a
Meas. Tech.ChEBML_208529
Ki 240±n/a nM
Citation Ambler, JBrown, LCockcroft, XLGrütter, MHayler, JJanus, DJones, DKane, PMenear, KPriestle, JSmith, GTalbot, MWalker, CVWathey, B Optimisation of the P2 pharmacophore in a series of thrombin inhibitors: ion-dipole interactions with lysine 60G. Bioorg Med Chem Lett9:1317-22 (1999) Prothrombin
Name:Prothrombin
Type:Protein
Mol. Mass.:70029.57
Organism:Homo sapiens (Human)
Description:P00734
Residue:622
BDBM50077050
NameBDBM50077050
Synonyms:3,3-Dimethyl-1,2,3,4-tetrahydro-quinoline-8-sulfonic acid [(S)-1-benzothiazol-2-ylmethyl-2-(4-ethyl-piperidin-1-yl)-2-oxo-ethyl]-amide | CHEMBL24982
TypeSmall organic molecule
Emp. Form.C28H36N4O3S2
Mol. Mass.540.74
SMILESCCC1CCN(CC1)C(=O)[C@H](Cc1nc2ccccc2s1)NS(=O)(=O)c1cccc2CC(C)(C)CNc12