Reaction Details
TargetD(2) dopamine receptor
LigandBDBM50077574
Substrate/Competitorn/a
Meas. Tech.ChEMBL_62895 (CHEMBL676134)
Ki 4.3±n/a nM
Citation Mewshaw, REWebb, MBMarquis, KLMcGaughey, GBShi, XWasik, TScerni, RBrennan, JAAndree, TH New generation dopaminergic agents. 6. Structure-activity relationship studies of a series of 4-(aminoethoxy)indole and 4-(aminoethoxy)indolone derivatives based on the newly discovered 3-hydroxyphenoxyethylamine D2 template. J Med Chem42:2007-20 (1999) 
 
D(2) dopamine receptor
Name:D(2) dopamine receptor
Type:G Protein-Coupled Receptor (GPCR)
Mol. Mass.:50931.60
Organism:Rattus norvegicus (rat)
Description:P61169
Residue:444
BDBM50077574
NameBDBM50077574
Synonyms:7-Chloro-4-[2-(1,2,4,5-tetrahydro-benzo[d]azepin-3-yl)-ethoxy]-1,3-dihydro-indol-2-one | CHEMBL292253
TypeSmall organic molecule
Emp. Form.C20H21ClN2O2
Mol. Mass.356.846
SMILESClc1ccc(OCCN2CCc3ccccc3CC2)c2CC(=O)Nc12