Reaction Details
TargetD(1A) dopamine receptor
LigandBDBM50077638
Substrate/Competitorn/a
Meas. Tech.ChEMBL_60495 (CHEMBL674251)
Ki 65±n/a nM
Citation Gu, YGBayburt, EKMichaelides, MRLin, CWShiosaki, K trans-2,6-,3,6- and 4,6-diaza-5,6,6a,7,8,12b-hexahydro-benzo[c]phenanthrene-10,11- diols as dopamine agonists. Bioorg Med Chem Lett9:1341-6 (1999) D(1A) dopamine receptor
Name:D(1A) dopamine receptor
Type:Enzyme
Mol. Mass.:49303.43
Organism:Homo sapiens (Human)
Description:P21728
Residue:446
BDBM50077638
NameBDBM50077638
Synonyms:(6aR,12bS)-5,6,6a,7,8,12b-Hexahydro-4,6-diaza-benzo[c]phenanthrene-10,11-diol | CHEMBL281932
TypeSmall organic molecule
Emp. Form.C16H16N2O2
Mol. Mass.268.3104
SMILESOc1cc2CC[C@H]3NCc4ncccc4[C@@H]3c2cc1O