Reaction Details
TargetDihydrofolate reductase
LigandBDBM50077796
Substrate/Competitorn/a
Meas. Tech.ChEMBL_54284 (CHEMBL666803)
Ki 1.5±n/a nM
Citation Zuccotto, FBrun, RGonzalez Pacanowska, DRuiz Perez, LMGilbert, IH The structure-based design and synthesis of selective inhibitors of Trypanosoma cruzi dihydrofolate reductase. Bioorg Med Chem Lett9:1463-8 (1999) Dihydrofolate reductase
Name:Dihydrofolate reductase
Type:Enzyme
Mol. Mass.:21453.99
Organism:Homo sapiens (Human)
Description:Recombinant human DHFR.
Residue:187
BDBM50077796
NameBDBM50077796
Synonyms:2-{4-[(4-Carboxy-butyl)-(2,4-diamino-pteridin-6-ylmethyl)-amino]-benzoylamino}-pentanedioic acid | CHEMBL284943
TypeSmall organic molecule
Emp. Form.C24H28N8O7
Mol. Mass.540.5285
SMILESNc1nc(N)c2nc(CN(CCCCC(O)=O)c3ccc(cc3)C(=O)NC(CCC(O)=O)C(O)=O)cnc2n1