Reaction Details
TargetThymidylate synthase
LigandBDBM50077836
Substrate/Competitorn/a
Meas. Tech.ChEMBL_209135 (CHEMBL814653)
Ki 1500±n/a nM
Citation Costi, PMRinaldi, MTondi, DPecorari, PBarlocco, DGhelli, SStroud, RMSanti, DVStout, TJMusiu, CMarangiu, EMPani, ACongiu, DLoi, GALa Colla, P Phthalein derivatives as a new tool for selectivity in thymidylate synthase inhibition. J Med Chem42:2112-24 (1999) 
 
Thymidylate synthase
Name:Thymidylate synthase
Type:Enzyme
Mol. Mass.:30475.81
Organism:Escherichia coli
Description:n/a
Residue:264
BDBM50077836
NameBDBM50077836
Synonyms:7,7-Bis-(4-hydroxy-phenyl)-2,7-dihydro-1H-6-oxa-cyclopenta[cd]phenalen-5-one | CHEMBL67851
TypeSmall organic molecule
Emp. Form.C26H18O4
Mol. Mass.394.4187
SMILESOc1ccc(cc1)C1(OC(=O)c2ccc3CCc4ccc1c2c34)c1ccc(O)cc1