Reaction Details
TargetThymidylate synthase
LigandBDBM18769
Substrate/Competitorn/a
Meas. Tech.ChEMBL_209135 (CHEMBL814653)
Ki 1600±n/a nM
Citation Costi, PMRinaldi, MTondi, DPecorari, PBarlocco, DGhelli, SStroud, RMSanti, DVStout, TJMusiu, CMarangiu, EMPani, ACongiu, DLoi, GALa Colla, P Phthalein derivatives as a new tool for selectivity in thymidylate synthase inhibition. J Med Chem42:2112-24 (1999) 
 
Thymidylate synthase
Name:Thymidylate synthase
Type:Enzyme
Mol. Mass.:30475.81
Organism:Escherichia coli
Description:n/a
Residue:264
BDBM18769
NameBDBM18769
Synonyms:1,8-naphthalein derivative, 17 CHEMBL303171 | Phenolnaphthalein derivative, 1
TypeSmall organic molecule
Emp. Form.C24H14F2O4
Mol. Mass.404.3624
SMILESOc1ccc(cc1F)C1(OC(=O)c2cccc3cccc1c23)c1ccc(O)c(F)c1