Reaction Details
TargetThymidylate synthase
LigandBDBM50077843
Substrate/Competitorn/a
Meas. Tech.ChEMBL_209135 (CHEMBL814653)
Ki 104700±n/a nM
Citation Costi, PMRinaldi, MTondi, DPecorari, PBarlocco, DGhelli, SStroud, RMSanti, DVStout, TJMusiu, CMarangiu, EMPani, ACongiu, DLoi, GALa Colla, P Phthalein derivatives as a new tool for selectivity in thymidylate synthase inhibition. J Med Chem42:2112-24 (1999) 
 
Thymidylate synthase
Name:Thymidylate synthase
Type:Enzyme
Mol. Mass.:30475.81
Organism:Escherichia coli
Description:n/a
Residue:264
BDBM50077843
NameBDBM50077843
Synonyms:3-Hydroxy-3-(2-hydroxy-phenyl)-3H-benzo[de]isochromen-1-one | CHEMBL305207
TypeSmall organic molecule
Emp. Form.C18H12O4
Mol. Mass.292.2855
SMILESOc1ccccc1C1(O)OC(=O)c2cccc3cccc1c23