Reaction Details
TargetThymidylate synthase
LigandBDBM50077845
Substrate/Competitorn/a
Meas. Tech.ChEMBL_209135 (CHEMBL814653)
Ki 1900±n/a nM
Citation Costi, PMRinaldi, MTondi, DPecorari, PBarlocco, DGhelli, SStroud, RMSanti, DVStout, TJMusiu, CMarangiu, EMPani, ACongiu, DLoi, GALa Colla, P Phthalein derivatives as a new tool for selectivity in thymidylate synthase inhibition. J Med Chem42:2112-24 (1999) 
 
Thymidylate synthase
Name:Thymidylate synthase
Type:Enzyme
Mol. Mass.:30475.81
Organism:Escherichia coli
Description:n/a
Residue:264
BDBM50077845
NameBDBM50077845
Synonyms:3,3-Bis-(3-chloro-4-hydroxy-phenyl)-3H-isobenzofuran-1-one | CHEMBL308417
TypeSmall organic molecule
Emp. Form.C20H12Cl2O4
Mol. Mass.387.213
SMILESOc1ccc(cc1Cl)C1(OC(=O)c2ccccc12)c1ccc(O)c(Cl)c1