Reaction Details
TargetThymidylate synthase
LigandBDBM50077850
Substrate/Competitorn/a
Meas. Tech.ChEMBL_209135 (CHEMBL814653)
Ki 1500±n/a nM
Citation Costi, PMRinaldi, MTondi, DPecorari, PBarlocco, DGhelli, SStroud, RMSanti, DVStout, TJMusiu, CMarangiu, EMPani, ACongiu, DLoi, GALa Colla, P Phthalein derivatives as a new tool for selectivity in thymidylate synthase inhibition. J Med Chem42:2112-24 (1999) 
 
Thymidylate synthase
Name:Thymidylate synthase
Type:Enzyme
Mol. Mass.:30475.81
Organism:Escherichia coli
Description:n/a
Residue:264
BDBM50077850
NameBDBM50077850
Synonyms:3,3-Bis-(3-chloro-4-hydroxy-phenyl)-3H-naphtho[2,3-c]furan-1-one | CHEMBL302555
TypeSmall organic molecule
Emp. Form.C24H14Cl2O4
Mol. Mass.437.272
SMILESOc1ccc(cc1Cl)C1(OC(=O)c2cc3ccccc3cc12)c1ccc(O)c(Cl)c1