Reaction Details
TargetThymidylate synthase
LigandBDBM50077852
Substrate/Competitorn/a
Meas. Tech.ChEMBL_209135 (CHEMBL814653)
Ki 700±n/a nM
Citation Costi, PMRinaldi, MTondi, DPecorari, PBarlocco, DGhelli, SStroud, RMSanti, DVStout, TJMusiu, CMarangiu, EMPani, ACongiu, DLoi, GALa Colla, P Phthalein derivatives as a new tool for selectivity in thymidylate synthase inhibition. J Med Chem42:2112-24 (1999) 
 
Thymidylate synthase
Name:Thymidylate synthase
Type:Enzyme
Mol. Mass.:30475.81
Organism:Escherichia coli
Description:n/a
Residue:264
BDBM50077852
NameBDBM50077852
Synonyms:6-Chloro-3,3-bis-(4-hydroxy-phenyl)-3H-benzo[de]isochromen-1-one; compound with 7-chloro-3,3-bis-(4-hydroxy-phenyl)-3H-benzo[de]isochromen-1-one | CHEMBL293670
TypeSmall organic molecule
Emp. Form.C24H15ClO4
Mol. Mass.402.826
SMILESOc1ccc(cc1)C1(OC(=O)c2cccc3c(Cl)ccc1c23)c1ccc(O)cc1